supplier sku,Product Title,category,description,image url,barcode,Weight (Grams),height,width,depth,Country of Origin,HS Codes
101010002,"Age of Bronze, Hail Caesar supplement",Book,"Hail Caeser :Age of Bronze, Hail Caesar supplement",https://cdn.shopify.com/s/files/1/0255/0949/4864/products/HC_Age_of_Bronze_front_cover_300DPI_RGB_907e6cdf-b2e0-414a-90e7-b769698d97d5.jpg?v=1604487555,9781911281498,306,,,,United Kingdom,49019900
101010003,Hail Caesar Army Lists: Biblical to Early Medieval,Book,Hail Caeser :Hail Caesar Army Lists: Biblical to Early Medieval,https://cdn.shopify.com/s/files/1/0255/0949/4864/products/101010003_Hail-Caesar_Army-List_Biblical-to-Early-Medieval1.jpg?v=1601216891,9781911281580,200,,,,United Kingdom,49019900
101510003,Caesar's Gallic Wars - Hail Caesar starter set,Starter Set,Hail Caeser :Caesar's Gallic Wars - Hail Caesar starter set,https://cdn.shopify.com/s/files/1/0255/0949/4864/products/101510003-Caesar_s-Gallic-Wars-Hail-Caesar-starter-set2.jpg?v=1670850867,5060917991414,750,,,,United Kingdom,95049080
102011001,Roman Veterans,Box - Plastic,Hail Caeser :Roman Veterans,https://cdn.shopify.com/s/files/1/0255/0949/4864/products/WGH-IR-02-Roman-Veterans-a_3ae0f06c-745d-42f6-8a80-3153d823068b.jpg?v=1575566682,5060200841440,118,150,225,46,United Kingdom,95030095
102011501,Hail Caesar: Celt Starter Army 2023,Starter Set,"<p>A Celt army is one of history's great spectacles – a mass of brightly patterned clothing charging headlong at their enemy, supported by fast cavalry and missile troops armed with javelins. Renowned for their ferocity in battle, what the Celts lacked in discipline they made up for in savagery and fighting spirit – they would hurl themselves at their enemies to sweep them away or die trying!</p> <p>This starter set contains enough units for one complete Hail Caesar Celt army division.</p> <p>Contains:</p> <ul> <li>1x Celt Chieftain (Warlord Resin™)</li> <li>100x Celt Warriors with command figures (plastic)</li> <li>12x Celt Cavalry (Warlord Resin™)</li> <li>Full-colour waterslide shield decals</li> <li>Plastic bases</li> </ul> <p><em><span style=""font-size: xx-small;"">Models supplied unassembled and unpainted </span></em></p>",https://cdn.shopify.com/s/files/1/0255/0949/4864/products/102011501-Hail-Caesar-Celt-Starter-Army2.jpg?v=1670850906,5060917991421,810,,,,United Kingdom,95049080
102013001,Saxon Ceorls,Box - Plastic,"<p>Armies of the warring Anglo-Saxon kingdoms were a common sight on the British Isles from 5th to 11th Century.</p> <p>Ceorls (also spelt Churls) were free peasants who formed the basis of society in Anglo-Saxon England.</p> <p>Their free status was marked by their right to bear arms, military service in the fyrd (army), attendance at local courts, and payment of dues directly to the king.</p> <p>Unarmoured and armed with spears, swords and axes, Ceorls rallied under the dragon standards at their lord’s call to arms.</p> <p>This box allows you to build 32 Saxon Ceorls with mixed melee weapons. with the option of making 8 of them with bows. </p> <p><em><span style=""font-size: xx-small;"">Models supplied unassembled and unpainted </span></em></p>",https://cdn.shopify.com/s/files/1/0255/0949/4864/products/102013001-Saxon-Ceorls-box-front.jpg?v=1575566733,5060393704942,218,,,,United Kingdom,95030095
102013002,Saxon Thegns,Box - Plastic,"<p>Thegns, the wealthy noblemen of Anglo-Saxon kingdoms, served as retainers for their lords, fulfilling their obligation of military service.</p> <p>Well-trained and equipped, thegns served as infantrymen, clad in chain mail armour and iron helmets shields.</p> <p>Led to battle under dragon banners, they provided Saxon armies with a steadfast, hard-hitting core.</p> <p><em><span style=""font-size: xx-small;"">Models supplied unassembled and unpainted </span></em></p>",https://cdn.shopify.com/s/files/1/0255/0949/4864/products/102013002-Saxon-Thegns-box-front.jpg?v=1575566723,5060393704959,217,,,,United Kingdom,95030095
102013101,Viking Hirdmen,Box - Plastic,"<p>Hirdmen were professional soldiers within a Viking lord's household (hird).</p> <p><strong>Contents:</strong></p> <ul> <li>32 plastic Viking Hirdmen warriors</li> <li>Colour decal sheet</li> <li>Colour banner sheet</li> </ul> <p>A mainstay of Viking armies, these fearsome warriors would be well equipped with the best weapons and armour available be they spears, swords, hand axes, or the mighty two-handed Dane axe.</p> <p>Clad in chainmail, shields and helmets Hirdmen were deeply loyal to their commander and their comrades-in-arms.</p> <p><em><span style=""font-size: xx-small;"">Models supplied unassembled and unpainted </span></em></p>",https://cdn.shopify.com/s/files/1/0255/0949/4864/products/102013101-Viking-Hirdmen-box-front.jpg?v=1575566737,5060393706175,216,,,,United Kingdom,95030095
102013102,Viking Bondi,Box - Plastic,"<p>Bondi were free men, craftsmen, farmers, sailors and traders.</p> <p><strong>Contents:</strong></p> <ul> <li>32 plastic Viking Bondi warriors</li> <li>Colour decal sheet</li> <li>Colour banner sheet</li> </ul> <p>As Bondi, they had the right to join their lord’s army and sail West in search of riches and glory.</p> <p>They bore spears, swords, axes and bows, but rarely wore any armour other than helmets and shields.</p> <p>This box allows you to build 32 Viking Bondi with mixed melee weapons. with the option of making 8 of them with bows.</p> <p><em><span style=""font-size: xx-small;"">Models suppled unassembled and unpainted </span></em></p>",https://cdn.shopify.com/s/files/1/0255/0949/4864/products/102013102-Viking-Bondi-box-front.jpg?v=1575566732,5060393706182,215,,,,United Kingdom,95030095
102614001,Successor Starter Army,Army Box,Hail Caeser :Successor Starter Army,https://cdn.shopify.com/s/files/1/0255/0949/4864/products/102614001_Successors_Starter_set.jpg?v=1575566478,5060393704591,1540,,,,United Kingdom,95030095
109911101,Late republic Caesarian Roman starter army,Army Box,"<p>Julius Caesar commanded his late republic Roman legions with skill and aggression, forging them into the best fighting force of the era. Each legionary is protected by chain armour and Scutum shield and armed with Gladius stabbing sword and Pilum javelin. Renowned for their discipline and training, the Roman legionaries are implacable in the face of the enemy – crushing all beneath their unrelenting advance!</p> <p>This starter set contains enough units for one complete Hail Caesar Late Republican Roman army division.</p> <p>Contents:</p> <ul> <li>2x Roman officers (metal)</li> <li>96x Roman legionaries with command figures (plastic)</li> <li>1x Scorpion bolt thrower (Warlord Resin™)</li> <li>Full-colour waterslide shield decals</li> <li>Plastic bases</li> </ul> <p><em><span style=""font-size: xx-small;"">Models supplied unassembled and unpainted </span></em></p>",https://cdn.shopify.com/s/files/1/0255/0949/4864/products/109911101-Caesarian-Roman-Starter-Army1.jpg?v=1680178738,5060393704904,930,225,302,91,United Kingdom,95030095
109913002,Saxon Starter Army,Starter Set,"<p>Leading with a Saxon Warlord, defend your homes and land with this Saxon starter army!</p> <p><strong>This complete starter set includes:</strong></p> <ul> <li>1 exclusive metal Saxon Warlord</li> <li>4 metal Saxon Hearthguard</li> <li>64 Saxon Ceorls</li> <li>64 Saxon Thegns</li> <li>4 waterslide decal sheets for shields</li> </ul> <p><em><span style=""font-size: xx-small;"">Models supplied unassembled and unpainted </span></em></p>",https://cdn.shopify.com/s/files/1/0255/0949/4864/products/109913002_Saxon_Starter_Army_box_lid.jpg?v=1575566723,5060393709909,1245,225,305,145,United Kingdom,95030095
109913103,Viking Starter Army,Starter Set,"<p>Expand to new lands and raid across Britania with a full Viking army!</p> <p><strong>This Starter set includes:</strong></p> <ul> <li>1 exclusive Viking Warlord</li> <li>4 metal Beserkers</li> <li>64 plastic Hirdman</li> <li>64 plastic Bondi</li> <li>4 waterslide decal sheet for Viking shields</li> </ul> <p><em><span style=""font-size: xx-small;"">Models supplied unassembled and unpainted </span></em></p>",https://cdn.shopify.com/s/files/1/0255/0949/4864/products/109913103_Viking_Starter_Army_box_lid.jpg?v=1575566737,5060393709916,1245,225,305,145,United Kingdom,95030095
109914501,Greek Starter Army,Army Box,Hail Caeser :Greek Starter Army,https://cdn.shopify.com/s/files/1/0255/0949/4864/products/109914501_Greek_Starter_Army_box_front.jpg?v=1575566739,5060393708490,1340,,,,United Kingdom,95030095
109914801,Spartans Starter army,Army Box,Hail Caeser :Spartans Starter army,https://cdn.shopify.com/s/files/1/0255/0949/4864/products/109914801_Spartan_Starter_Army_box_front.jpg?v=1575566723,5060393708506,1363,,,,United Kingdom,95030095
151010002,SPQR: Death or Glory Rulebook,Book,SPQR :SPQR: Death or Glory Rulebook,https://cdn.shopify.com/s/files/1/0255/0949/4864/products/MicrosoftTeams-image_bcf25ee9-8580-4f8c-b020-0ceb65e946cb.jpg?v=1618586103,9781911281672,850,,,,Lithuania,49019900
152011001,SPQR: Caesar's Legions - Legionaries with pilum,Box - Plastic,SPQR :SPQR: Caesar's Legions - Legionaries with pilum,https://cdn.shopify.com/s/files/1/0255/0949/4864/products/152011001_SPQR_CaesarsLegions_LegionariesPilum03.jpg?v=1626049710,5060572504813,110,150,225,46,United Kingdom,95030095
152011005,SPQR: Caesar's Legions - Legionaries with gladius & sling,Box - Plastic,SPQR :SPQR: Caesar's Legions - Legionaries with gladius & sling,https://cdn.shopify.com/s/files/1/0255/0949/4864/products/152011005_SPQR_CaesarsLegions_LegionariesGladius04.jpg?v=1626049717,5060572504837,130,150,225,46,United Kingdom,95030095
152012001,Not on web -SPQR: Macedonia - Pezhetairoi,Box - Plastic,"<p>The Pezhetairoi (Foot Companions) built upon the success of the Greek phalanx – and improved it. Deeper formations were used, along with the sarissa, a pike much longer than the spears used by the city-states. Whereas the phalanx was the mainstay of Greek armies, under Alexander they were used to pin enemy units and hold them until they could be smashed by the Companion Cavalry.</p> <p>Contains 12 plastic miniatures</p> <p><em><span style=""font-size: xx-small;"">Models supplied unassembled and unpainted </span></em></p>",https://cdn.shopify.com/s/files/1/0255/0949/4864/products/152012001_SPQRMacedoniaPezhetairoi01.jpg?v=1616663432,5060572504622,110,150,225,46,United Kingdom,95030095
152012003,SPQR: Germania -  Horsemen command,Box - WL Resin,"<p>Provide extra boons to a cavalry unit with a musician and standard bearer - as well as an ideal alternative sculpt for representing a lightly armed mounted hero, showing off his superiority by displaying the severed head of a defeated foe affixed to his mount.</p> <p>Contains 3 Warlord Resin models and SPQR revised edition horsemen command card.</p> <p><em><span style=""font-size: xx-small;"">Models supplied unassembled and unpainted </span></em></p>",https://cdn.shopify.com/s/files/1/0255/0949/4864/products/152012003_SPQR_GermaniaHorsemenCommand03.jpg?v=1626049731,5060572505322,50,151,112,46,United Kingdom,95030099
152013003,Not on web -SPQR: Dacia & Sarmatia - Dacian Nobles,Box - WL Resin,"<p>Richer and better equipped than the falxmen, these nobles wore Phrygian caps to demonstrate their higher status, and were sometimes known as capmen. Despite their more ornate weaponry, they were no less brave than their lower-bred counterparts and could be counted upon to defend their territory with relish.</p> <p>Nobles benefit from the ‘strength in numbers’ special rule and are especially dangerous on the charge owing to the ‘Wild Charge’ special rule. They also have generous access to an armoury to customise your own warband.</p> <p>Contains 12 Warlord Resin infantry models</p> <p><em><span style=""font-size: xx-small;"">Models supplied unassembled and unpainted </span></em></p>",https://cdn.shopify.com/s/files/1/0255/0949/4864/products/152013003_SPQRDacianNobles01.jpg?v=1626049786,5060572505476,100,151,112,46,United Kingdom,95030099
152014001,SPQR: Gaul - Warriors,Box - P+WLR,"<p>The backbone of the warband, these fierce warriors were bloodthirsty to the core. Weight of numbers makes up for their comparatively poor armaments. A charging force of Gaul warriors was a terror to endure, such was their tenacity on the field of battle.</p> <p>Contains 20 plastic models and SPQR revised edition Gaul warriors card.</p> <p><em><span style=""font-size: xx-small;"">Models supplied unassembled and unpainted </span></em></p>",https://cdn.shopify.com/s/files/1/0255/0949/4864/products/152014001_SPQR_GaulWarriors03.jpg?v=1626049711,5060572504424,100,150,225,46,United Kingdom,95030095
152213001,SPQR: Dacia & Sarmatia - Heroes,Box - WL Resin,SPQR :SPQR: Dacia & Sarmatia - Heroes,https://cdn.shopify.com/s/files/1/0255/0949/4864/products/152213001_SPQRDacianHeroes01_4c9af4f5-0cc3-4ef9-a80c-bb3852a43717.jpg?v=1662729778,5060572505445,77.6,151,112,46,United Kingdom,95030099
152213002,SPQR: Dacia & Sarmatia - Dacian Falxmen,Box - WL Resin,"<p>The Roman legions soon came to respect the warriors of Dacia. Far from being simple barbarians, they were brave and carried a large curved sword, the falx, that easily slipped past the shields of the legionaries. Roman casualties quickly mounted when facing Dacians, and new tactics had to be devised to beat them.</p> <p>In addition to the bonuses conferred by the falx, Dacian Falxman benefit from strength in numbers. When numbering at least 10, they receive a bonus to Bravery checks, whilst each model receives a bonus melee dice when charging for the 'Wild Charge' special rule.</p> <p>Contains 12 infantry in Warlord Resin.</p> <p><em><span style=""font-size: xx-small;"">Models supplied unassembled and unpainted</span></em></p>",https://cdn.shopify.com/s/files/1/0255/0949/4864/products/152213002_SPQRDacianFalxmen01.jpg?v=1662729755,5060572505452,80,151,112,46,United Kingdom,95030099
152213004,SPQR: Dacia & Sarmatia - Dacian Tribesmen with slings,Box - WL Resin,"<p>Dacian tribesmen were poorer or less skilful than the falxmen and nobles, but provided support that was more than adequate in the form of javelins, sling stones and arrows. In sufficient numbers, they were capable of facing even veteran soldiers and many a legionary met his end at their hands.</p> <p>Though slings are slow to fire in comparison with other ranged weapons in the game, they pack quite a punch and benefit from enormous range, keeping the relatively fragile Tribesmen out of enemy range. Couple this with their 'Hit and Run' special rule and take 10 or more to activate the 'strength in numbers' special rule - and make the lowly tribesmen troublesome for even the most experienced enemy warrior.</p> <p>Contains 12 infantry in Warlord resin.</p> <p><em><span style=""font-size: xx-small;"">Models supplied unassembled and unpainted</span></em></p>",https://cdn.shopify.com/s/files/1/0255/0949/4864/products/152213004_SPQRDacianTribesmenwithSlings01.jpg?v=1662729765,5060572505469,90.44,151,112,46,United Kingdom,95030099
152213006,SPQR: Dacia & Sarmatia - Dacian Tribesmen with javelins,Box - WL Resin,"<p>Dacian tribesmen were poorer or less skilful than the falxmen and nobles, but provided support that was more than adequate in the form of javelins, sling stones and arrows. In sufficient numbers, they were capable of facing even veteran soldiers and many a legionary met his end at their hands.</p> <p>Arm your tribesmen with javelins for an especially ‘lethal’ ranged attack, but don’t go unsupported – javelins have a relatively short range and the tribesmen will be a ripe target for revenge. Make sure to take advantage of their ‘hit and run’ special rule to counteract the inevitable counter-charge.</p> <p>Contains 12 Warlord Resin infantry models</p> <p><em><span style=""font-size: xx-small;"">Models supplied unassembled and unpainted </span></em></p>",https://cdn.shopify.com/s/files/1/0255/0949/4864/products/152213006_SPQRDacianTribesmenwithJavelins01.jpg?v=1662729763,5060572505490,130,151,112,46,United Kingdom,95030099
152213008,SPQR: Dacia & Sarmatia - Sarmatian light cavalry,Box - WL Resin,"<p>While the cataphracts earned all the glory, it was the wave upon wave of light cavalry that formed the core of a Sarmatian force. Whether carrying short spears or bows, these riders could keep an enemy perpetually off-balance, slowly whittling them down until the cataphracts arrived.</p> <p>Light cavalry are an integral component of any Sarmatian Warband, capable of harrying the enemy force from both up close and afar, armed as they are with both bows and short spears.</p> <p>Contains 6 Cavalry Models in Warlord Resin</p> <p><em><span style=""font-size: xx-small;"">Models supplied unassembled and unpainted </span></em></p>",https://cdn.shopify.com/s/files/1/0255/0949/4864/products/152213008_SPQRSarmatianLightCavalry01.jpg?v=1662729775,5060572505520,140,150,225,46,United Kingdom,95030099
152213009,SPQR: Dacia & Sarmatia - Dacian Scorpio team ,Box - WL Resin,"<p>Once close allies of Rome, Dacia was the recipient of money and weapons, including the lethal Scorpio. Suitably reinforced, Dacian strongholds and villages became a lot tougher for Romans to assault when shot at by their own mightiest weapons.</p> <p>A scorpio has a massive range on the battlefield and has the ‘Lethal 3’ and ‘Smasher’ rules. An enemy would do well to take cover as this mighty war machine is capable of removing multiple models with a single hit!</p> <p>Contains 1 Warlord Resin scorpion and 2 crew</p> <p><em><span style=""font-size: xx-small;"">Models supplied unassembled and unpainted </span></em></p>",https://cdn.shopify.com/s/files/1/0255/0949/4864/products/152213009_SPQRDacianScorpioTeam01.jpg?v=1662729758,5060572505544,60,110,75,30,United Kingdom,95030099
152214001,LCTB -SPQR: Gaul - Heroes,Box - WL Resin,"<p>To lead your warband, you'll need powerful heroes. Vercingetorix of the Arveni tribe was a Gallic Chieftain who united the tribes of Gaul to repel Caesar's invasion of 52BCE. Lucterius fought against the Roman empire until the climax of the Gallic Wars at the Siege of Uxellodunum. You can also field a druid; these highly revered spiritual leaders can be used to bolster your troops' morale. These heroes provide a suitable centerpiece for your warband, and prove a formidable fighting force in their own right.</p> <p>Contains:</p> <ul> <li>3 resin foot figures</li> <li>1 resin mounted figure</li> <li>Hero unit card</li> <li>Character cards</li> </ul> <p><em><span style=""font-size: xx-small;"">Models supplied unassembled and unpainted </span></em></p>",https://cdn.shopify.com/s/files/1/0255/0949/4864/products/152214001_SPQR_GaulHeroes03.jpg?v=1626049682,5060572504417,70,151,112,46,United Kingdom,95030099
152214002,SPQR: Gaul - Skyclad Warriors,Box - WL Resin,"<p>Most ?ghting men of the tribe will be warriors, men (and not a few women) who had proven themselves in battle and were intent on becoming both rich and respected within the warband. Though each ?ghts as an individual, a rushing mob of these warriors is a fearsome thing to behold as they charge forward with crazed eyes, hollering war cries, and deadly intent.</p> <p>Some Warriors choose to go into battle naked, trusting to their faith for protection and taking advantage of the unnerving sight this caused. If a unit of Warriors do not take any armour other than a Large Shield and their miniatures wear no clothing, they gain a +1 bonus to Melee checks.</p> <p><em>Contains 10 Warlord Resin models</em></p> <p><em><span style=""font-size: xx-small;"">Models supplied unassembled and unpainted </span></em></p>",https://cdn.shopify.com/s/files/1/0255/0949/4864/products/152214002_SPQR_GaulSkycladWarriors03.jpg?v=1626049697,5060572504486,60,151,112,46,United Kingdom,95030099
152214003,SPQR: Gaul - Tribesmen Archers,Box - WL Resin,"<p>Those tribesmen yet to prove themselves in battle could still join the warriors, taking the Gaul’s favoured hunting weapon, the bow. Too poor or too young to have much in the way of armour, these men fan out before the warband. They engaged enemy skirmishers and made withering attacks on the enemy before the battle erupted into full-scale violence.</p> <p>Contains 12 Warlord Resin models and SPQR revised edition Tribesmen Archers card.</p> <p><em><span style=""font-size: xx-small;"">Models supplied unassembled and unpainted </span></em></p>",https://cdn.shopify.com/s/files/1/0255/0949/4864/products/152214003_SPQR_GaulTribesmenArchers03.jpg?v=1626049719,5060572504493,80,151,112,46,United Kingdom,95030099
152214004,SPQR: Gaul - Tribesmen Slingers,Box - WL Resin,"<p>Capable of harassing their foes from afar, Gaul tribesmen slingers were lightly armoured missile troops that were yet to prove themselves as warriors; yet were still highly effective at disrupting the ranks of their foes.</p> <p>Contains 12 Warlord Resin models and SPQR revised edition Tribesmen Slingers card.</p> <p><em><span style=""font-size: xx-small;"">Models supplied unassembled and unpainted </span></em></p>",https://cdn.shopify.com/s/files/1/0255/0949/4864/products/152214004_SPQR_GaulTribesmenSlingers03.jpg?v=1626049694,5060572504448,80,151,112,46,United Kingdom,95030099
152214005,SPQR: Gaul - Tribesmen with Javelins,Box - WL Resin,"<p>You are also able to equip your Tribesmen with Javelins. Though limited to a single use, they have the <em><strong>Lethal 2 </strong></em>keyword, oftentimes thwarting heavily armoured opposition. Use them to thin the ranks of your foes before the main melee is met.</p> <p><em>Contains 12 Warlord Resin models</em></p> <p><em><span style=""font-size: xx-small;"">Models supplied unassembled and unpainted </span></em></p>",https://cdn.shopify.com/s/files/1/0255/0949/4864/products/152214005_SPQR_GaulTribesmenwithJavelins03.jpg?v=1626049689,5060572504509,80,151,112,46,United Kingdom,95030099
152214006,SPQR: Gaul - Horsemen,Box - WL Resin,"<p>The Gaul horsemen were heavy cavalry, consisting of the richest nobles of a given tribe. Capable of delivering a swift hammer blow to the enemy ranks, they make a powerful addition to any warband.</p> <p>Contains:</p> <ul> <li>6 resin cavalry figures</li> <li>Horsemen unit card</li> </ul> <p><em><span style=""font-size: xx-small;"">Models supplied unassembled and unpainted </span></em></p>",https://cdn.shopify.com/s/files/1/0255/0949/4864/products/152214006_SPQR_GaulHorsemen04.jpg?v=1626049713,5060572504431,140,150,225,46,United Kingdom,95030099
152214007,SPQR: Gaul - War Dogs,Box - WL Resin,"<p>Trained to ignore the noise and chaos of battle, the war dogs used by Gallic tribes were easily capable of ripping the throat out of an enemy. Attacking on command, their handlers assembled them into waves of slavering killers who could break even a disciplined line.</p> <p>Contains 3 Warlord Resin models with 12 Dogs and SPQR revised edition war dogs card.</p> <p><em><span style=""font-size: xx-small;"">Models supplied unassembled and unpainted </span></em></p>",https://cdn.shopify.com/s/files/1/0255/0949/4864/products/152214007_SPQR_GaulWarDogs03.jpg?v=1626049676,5060572504516,50,151,112,46,United Kingdom,95030099
152214008,SPQR: Germania - Heroes,Box - WL Resin,SPQR :SPQR: Germania - Heroes,https://cdn.shopify.com/s/files/1/0255/0949/4864/products/152214008_SPQR_GermaniaHeroes03.jpg?v=1626049724,5060572505278,60,151,112,46,United Kingdom,95030099